Information card for entry 7237725
Formula | C20 H64 Br14 N8 O10 Pb3 |
Calculated formula | C20 H64 Br14 N8 O10 Pb3 |
Title of publication | Dual phosphorescence from the organic and inorganic moieties of 1D hybrid perovskites of the Pbn′Br4n′+2 series (n′ = 2, 3, 4, 5) |
Authors of publication | Ben Haj Salah, Maroua; Mercier, Nicolas; Allain, Magali; Zouari, Nabil; Botta, Chiara |
Journal of publication | Journal of Materials Chemistry C |
Year of publication | 2019 |
Journal volume | 7 |
Journal issue | 15 |
Pages of publication | 4424 |
a | 8.274 ± 0.005 Å |
b | 11.58 ± 0.005 Å |
c | 15.717 ± 0.005 Å |
α | 71.769 ± 0.005° |
β | 77.947 ± 0.005° |
γ | 72.105 ± 0.005° |
Cell volume | 1350.5 ± 1.1 Å3 |
Cell temperature | 150 ± 10 K |
Ambient diffraction temperature | 149.9 ± 0.3 K |
Number of distinct elements | 6 |
Space group number | 1 |
Hermann-Mauguin space group symbol | P 1 |
Hall space group symbol | P 1 |
Residual factor for all reflections | 0.0325 |
Residual factor for significantly intense reflections | 0.0306 |
Weighted residual factors for significantly intense reflections | 0.0738 |
Weighted residual factors for all reflections included in the refinement | 0.0745 |
Goodness-of-fit parameter for all reflections included in the refinement | 1.015 |
Diffraction radiation wavelength | 1.54184 Å |
Diffraction radiation type | CuKα |