Information card for entry 7237727
Formula | C18 H50 Br10 N6 O7 Pb2 |
Calculated formula | C18 H50 Br10 N6 O7 Pb2 |
Title of publication | Dual phosphorescence from the organic and inorganic moieties of 1D hybrid perovskites of the Pbn′Br4n′+2 series (n′ = 2, 3, 4, 5) |
Authors of publication | Ben Haj Salah, Maroua; Mercier, Nicolas; Allain, Magali; Zouari, Nabil; Botta, Chiara |
Journal of publication | Journal of Materials Chemistry C |
Year of publication | 2019 |
Journal volume | 7 |
Journal issue | 15 |
Pages of publication | 4424 |
a | 12.3316 ± 0.0004 Å |
b | 8.0863 ± 0.0002 Å |
c | 23.0098 ± 0.0007 Å |
α | 90° |
β | 101.621 ± 0.003° |
γ | 90° |
Cell volume | 2247.44 ± 0.12 Å3 |
Cell temperature | 150 ± 0.1 K |
Ambient diffraction temperature | 150 ± 0.1 K |
Number of distinct elements | 6 |
Space group number | 4 |
Hermann-Mauguin space group symbol | P 1 21 1 |
Hall space group symbol | P 2yb |
Residual factor for all reflections | 0.0621 |
Residual factor for significantly intense reflections | 0.0599 |
Weighted residual factors for significantly intense reflections | 0.1649 |
Weighted residual factors for all reflections included in the refinement | 0.1686 |
Goodness-of-fit parameter for all reflections included in the refinement | 1.004 |
Diffraction radiation wavelength | 1.54184 Å |
Diffraction radiation type | CuKα |