Information card for entry 7237735
Formula | C14 H13 B F2 N3 O2 |
Calculated formula | C14 H13 B F2 N3 O2 |
Title of publication | Pure E/Z isomers of N-methylpyrrole-benzohydrazide-based BF2 complexes: remarkable aggregation-, crystallization-induced emission switching properties and application in sensing intracellular pH microenvironment |
Authors of publication | Yu, Yizhe; Yu, Changjiang; Wu, Qinghua; Wang, Hua; Jiao, Lijuan; Wong, Wai-Yeung; Hao, Erhong |
Journal of publication | Journal of Materials Chemistry C |
Year of publication | 2019 |
Journal volume | 7 |
Journal issue | 15 |
Pages of publication | 4533 |
a | 7.3108 ± 0.0005 Å |
b | 6.7983 ± 0.0005 Å |
c | 14.1226 ± 0.0011 Å |
α | 90° |
β | 91.598 ± 0.002° |
γ | 90° |
Cell volume | 701.63 ± 0.09 Å3 |
Cell temperature | 293 ± 2 K |
Ambient diffraction temperature | 293 ± 2 K |
Number of distinct elements | 6 |
Space group number | 11 |
Hermann-Mauguin space group symbol | P 1 21/m 1 |
Hall space group symbol | -P 2yb |
Residual factor for all reflections | 0.0504 |
Residual factor for significantly intense reflections | 0.0402 |
Weighted residual factors for significantly intense reflections | 0.0996 |
Weighted residual factors for all reflections included in the refinement | 0.1038 |
Goodness-of-fit parameter for all reflections included in the refinement | 1.103 |
Diffraction radiation wavelength | 0.71073 Å |
Diffraction radiation type | MoKα |