Information card for entry 7237745
Formula | C26 H19 F |
Calculated formula | C26 H19 F |
Title of publication | Fluorination of the tetraphenylethene core: synthesis, aggregation-induced emission, reversible mechanofluorochromism and thermofluorochromism of fluorinated tetraphenylethene derivatives |
Authors of publication | Zhang, Hao; Nie, Yong; Miao, Jinling; Zhang, Dengqing; Li, Yexin; Liu, Guangning; Sun, Guoxin; Jiang, Xuchuan |
Journal of publication | Journal of Materials Chemistry C |
Year of publication | 2019 |
Journal volume | 7 |
Journal issue | 11 |
Pages of publication | 3306 |
a | 9.9314 ± 0.0007 Å |
b | 9.4452 ± 0.0006 Å |
c | 10.8609 ± 0.0008 Å |
α | 90° |
β | 108.374 ± 0.002° |
γ | 90° |
Cell volume | 966.86 ± 0.12 Å3 |
Cell temperature | 298 ± 2 K |
Ambient diffraction temperature | 298.15 K |
Number of distinct elements | 3 |
Space group number | 4 |
Hermann-Mauguin space group symbol | P 1 21 1 |
Hall space group symbol | P 2yb |
Residual factor for all reflections | 0.0806 |
Residual factor for significantly intense reflections | 0.0551 |
Weighted residual factors for significantly intense reflections | 0.1549 |
Weighted residual factors for all reflections included in the refinement | 0.1783 |
Goodness-of-fit parameter for all reflections included in the refinement | 1.04 |
Diffraction radiation wavelength | 0.71073 Å |
Diffraction radiation type | MoKα |