Information card for entry 7237756
Formula | C42 H34 N2 O2 S3 |
Calculated formula | C42 H34 N2 O2 S3 |
Title of publication | The influence of molecular geometry on the efficiency of thermally activated delayed fluorescence |
Authors of publication | Nobuyasu, Roberto S.; Ward, Jonathan S.; Gibson, Jamie; Laidlaw, Beth A.; Ren, Zhongjie; Data, Przemyslaw; Batsanov, Andrei S.; Penfold, Thomas J.; Bryce, Martin R.; Dias, Fernando B. |
Journal of publication | Journal of Materials Chemistry C |
Year of publication | 2019 |
Journal volume | 7 |
Journal issue | 22 |
Pages of publication | 6672 |
a | 12.9513 ± 0.001 Å |
b | 14.1812 ± 0.0011 Å |
c | 18.9798 ± 0.0015 Å |
α | 76.632 ± 0.003° |
β | 83.723 ± 0.003° |
γ | 83.531 ± 0.003° |
Cell volume | 3357.4 ± 0.5 Å3 |
Cell temperature | 120 K |
Ambient diffraction temperature | 120 K |
Number of distinct elements | 5 |
Space group number | 2 |
Hermann-Mauguin space group symbol | P -1 |
Hall space group symbol | -P 1 |
Residual factor for all reflections | 0.0694 |
Residual factor for significantly intense reflections | 0.0433 |
Weighted residual factors for significantly intense reflections | 0.1082 |
Weighted residual factors for all reflections included in the refinement | 0.1207 |
Goodness-of-fit parameter for all reflections included in the refinement | 1.028 |
Diffraction radiation probe | x-ray |
Diffraction radiation wavelength | 0.71073 Å |
Diffraction radiation type | MoKα |