Information card for entry 7237763
Formula | C41 H41 F6 N2 O3 P3 Pt |
Calculated formula | C41 H41 F6 N2 O3 P3 Pt |
Title of publication | Highly efficient platinum-based emitters for warm white light emitting diodes |
Authors of publication | Sicilia, Violeta; Fuertes, Sara; Chueca, Andrés J.; Arnal, Lorenzo; Martín, Antonio; Perálvarez, Mariano; Botta, Chiara; Giovanella, Umberto |
Journal of publication | Journal of Materials Chemistry C |
Year of publication | 2019 |
Journal volume | 7 |
Journal issue | 15 |
Pages of publication | 4509 |
a | 10.85809 ± 0.00011 Å |
b | 13.99284 ± 0.00015 Å |
c | 14.07706 ± 0.00019 Å |
α | 93.6331 ± 0.001° |
β | 109.682 ± 0.0011° |
γ | 92.2688 ± 0.0008° |
Cell volume | 2005.58 ± 0.04 Å3 |
Cell temperature | 100 ± 2 K |
Ambient diffraction temperature | 100 ± 2 K |
Number of distinct elements | 7 |
Space group number | 2 |
Hermann-Mauguin space group symbol | P -1 |
Hall space group symbol | -P 1 |
Residual factor for all reflections | 0.0178 |
Residual factor for significantly intense reflections | 0.0168 |
Weighted residual factors for significantly intense reflections | 0.0385 |
Weighted residual factors for all reflections included in the refinement | 0.0388 |
Goodness-of-fit parameter for all reflections included in the refinement | 1.043 |
Diffraction radiation wavelength | 0.71073 Å |
Diffraction radiation type | MoKα |