Information card for entry 7237765
Formula | C17 H18 N4 |
Calculated formula | C17 H18 N4 |
Title of publication | Homoleptic platinum(ii) complexes with pyridyltriazole ligands: excimer-forming phosphorescent emitters for solution-processed OLEDs |
Authors of publication | Walden, Melissa T.; Pander, Piotr; Yufit, Dmitry S.; Dias, Fernando B.; Williams, J. A. Gareth |
Journal of publication | Journal of Materials Chemistry C |
Year of publication | 2019 |
Journal volume | 7 |
Journal issue | 22 |
Pages of publication | 6592 |
a | 5.9123 ± 0.0006 Å |
b | 13.2287 ± 0.0013 Å |
c | 18.6718 ± 0.0019 Å |
α | 90° |
β | 98.757 ± 0.004° |
γ | 90° |
Cell volume | 1443.3 ± 0.3 Å3 |
Cell temperature | 120 K |
Ambient diffraction temperature | 120 K |
Number of distinct elements | 3 |
Space group number | 14 |
Hermann-Mauguin space group symbol | P 1 21/n 1 |
Hall space group symbol | -P 2yn |
Residual factor for all reflections | 0.079 |
Residual factor for significantly intense reflections | 0.0467 |
Weighted residual factors for significantly intense reflections | 0.0942 |
Weighted residual factors for all reflections included in the refinement | 0.1057 |
Goodness-of-fit parameter for all reflections included in the refinement | 1.031 |
Diffraction radiation probe | x-ray |
Diffraction radiation wavelength | 0.71073 Å |
Diffraction radiation type | MoKα |