Information card for entry 7237767
Formula | C34 H34 N8 Pt |
Calculated formula | C34 H34 N8 Pt |
Title of publication | Homoleptic platinum(ii) complexes with pyridyltriazole ligands: excimer-forming phosphorescent emitters for solution-processed OLEDs |
Authors of publication | Walden, Melissa T.; Pander, Piotr; Yufit, Dmitry S.; Dias, Fernando B.; Williams, J. A. Gareth |
Journal of publication | Journal of Materials Chemistry C |
Year of publication | 2019 |
Journal volume | 7 |
Journal issue | 22 |
Pages of publication | 6592 |
a | 11.6673 ± 0.0005 Å |
b | 5.587 ± 0.0003 Å |
c | 21.8713 ± 0.001 Å |
α | 90° |
β | 101.028 ± 0.0015° |
γ | 90° |
Cell volume | 1399.36 ± 0.12 Å3 |
Cell temperature | 120 K |
Ambient diffraction temperature | 120 K |
Number of distinct elements | 4 |
Space group number | 14 |
Hermann-Mauguin space group symbol | P 1 21/c 1 |
Hall space group symbol | -P 2ybc |
Residual factor for all reflections | 0.0624 |
Residual factor for significantly intense reflections | 0.0377 |
Weighted residual factors for significantly intense reflections | 0.0787 |
Weighted residual factors for all reflections included in the refinement | 0.0847 |
Goodness-of-fit parameter for all reflections included in the refinement | 1.161 |
Diffraction radiation probe | x-ray |
Diffraction radiation wavelength | 0.71073 Å |
Diffraction radiation type | MoKα |