Information card for entry 7237784
Formula | C38 H24 Cl2 N2 O2 |
Calculated formula | C38 H24 Cl2 N2 O2 |
Title of publication | The photomechanic effects of the molecular crystals based on 5-chloro-2-(naphthalenylvinyl)benzoxazols fueled by topo-photochemical reactions |
Authors of publication | Peng, Jiang; Ye, Kaiqi; Liu, Cheng; Sun, Jingbo; Lu, Ran |
Journal of publication | Journal of Materials Chemistry C |
Year of publication | 2019 |
Journal volume | 7 |
Journal issue | 18 |
Pages of publication | 5433 |
a | 10.2664 ± 0.0004 Å |
b | 11.4804 ± 0.0004 Å |
c | 13.9234 ± 0.0006 Å |
α | 106.434 ± 0.002° |
β | 108.935 ± 0.002° |
γ | 99.36 ± 0.002° |
Cell volume | 1429.08 ± 0.1 Å3 |
Cell temperature | 100 ± 2 K |
Ambient diffraction temperature | 100 K |
Number of distinct elements | 5 |
Space group number | 2 |
Hermann-Mauguin space group symbol | P -1 |
Hall space group symbol | -P 1 |
Residual factor for all reflections | 0.0465 |
Residual factor for significantly intense reflections | 0.0378 |
Weighted residual factors for significantly intense reflections | 0.0919 |
Weighted residual factors for all reflections included in the refinement | 0.0973 |
Goodness-of-fit parameter for all reflections included in the refinement | 1.02 |
Diffraction radiation wavelength | 0.71073 Å |
Diffraction radiation type | MoKα |