Information card for entry 7237806
Formula | C24 H28 Cl2 N4 O7 S2 |
Calculated formula | C24 H28 Cl2 N4 O7 S2 |
Title of publication | Smart, chiral, and nonconjugated cyclohexane-based bis-salicylaldehyde hydrazides: multi-stimuli-responsive, turn-on, ratiometric, and thermochromic fluorescence, single-crystal structures via DFT calculations |
Authors of publication | Wang, Man; Cheng, Caiqi; Li, Chunbo; Wu, Dehua; Song, Jintong; Wang, Jun; Zhou, Xiangge; Xiang, Haifeng; Liu, Jin |
Journal of publication | Journal of Materials Chemistry C |
Year of publication | 2019 |
Journal volume | 7 |
Journal issue | 22 |
Pages of publication | 6767 |
a | 10.7942 ± 0.0008 Å |
b | 11.0971 ± 0.0009 Å |
c | 15.1654 ± 0.0009 Å |
α | 95.79 ± 0.006° |
β | 104.335 ± 0.006° |
γ | 114.902 ± 0.008° |
Cell volume | 1552.3 ± 0.2 Å3 |
Cell temperature | 293 ± 2 K |
Ambient diffraction temperature | 293 ± 2 K |
Number of distinct elements | 6 |
Space group number | 2 |
Hermann-Mauguin space group symbol | P -1 |
Hall space group symbol | -P 1 |
Residual factor for all reflections | 0.1539 |
Residual factor for significantly intense reflections | 0.1115 |
Weighted residual factors for significantly intense reflections | 0.351 |
Weighted residual factors for all reflections included in the refinement | 0.3966 |
Goodness-of-fit parameter for all reflections included in the refinement | 1.381 |
Diffraction radiation probe | x-ray |
Diffraction radiation wavelength | 0.71073 Å |
Diffraction radiation type | MoKα |