Information card for entry 7237812
Formula | C31 H28 F6 Ir N3 S2 |
Calculated formula | C31 H28 F6 Ir N3 S2 |
Title of publication | Fast synthesis of iridium(iii) complexes with sulfur-containing ancillary ligand for high-performance green OLEDs with EQE exceeding 31% |
Authors of publication | Lu, Guang-Zhao; Tu, Zhen-Long; Liu, Liang; Zhang, Wen-Wei; Zheng, You-Xuan |
Journal of publication | Journal of Materials Chemistry C |
Year of publication | 2019 |
Journal volume | 7 |
Journal issue | 24 |
Pages of publication | 7273 |
a | 15.709 ± 0.0007 Å |
b | 19.7575 ± 0.0009 Å |
c | 21.8169 ± 0.0009 Å |
α | 90° |
β | 90° |
γ | 90° |
Cell volume | 6771.3 ± 0.5 Å3 |
Cell temperature | 296 ± 2 K |
Ambient diffraction temperature | 296 ± 2 K |
Number of distinct elements | 6 |
Space group number | 60 |
Hermann-Mauguin space group symbol | P b c n |
Hall space group symbol | -P 2n 2ab |
Residual factor for all reflections | 0.0287 |
Residual factor for significantly intense reflections | 0.0212 |
Weighted residual factors for significantly intense reflections | 0.0506 |
Weighted residual factors for all reflections included in the refinement | 0.0547 |
Goodness-of-fit parameter for all reflections included in the refinement | 1.075 |
Diffraction radiation wavelength | 0.71073 Å |
Diffraction radiation type | MoKα |