Information card for entry 7237833
Formula | C25 H18 O3 S2 |
Calculated formula | C25 H18 O3 S2 |
Title of publication | Achievement of persistent and efficient organic room-temperature phosphorescence with temperature-response by adjusting the proportion of excited-state configurations in coupled molecules |
Authors of publication | Chen, Junru; Rahman, Naveed Ur; Mao, Zhu; Zhao, Juan; Yang, Zhiyong; Liu, Siwei; Zhang, Yi; Chi, Zhenguo |
Journal of publication | Journal of Materials Chemistry C |
Year of publication | 2019 |
Journal volume | 7 |
Journal issue | 27 |
Pages of publication | 8250 |
a | 7.156 ± 0.0018 Å |
b | 7.9129 ± 0.0018 Å |
c | 35.708 ± 0.01 Å |
α | 90° |
β | 91.7 ± 0.02° |
γ | 90° |
Cell volume | 2021.1 ± 0.9 Å3 |
Cell temperature | 298 K |
Ambient diffraction temperature | 298 K |
Number of distinct elements | 4 |
Space group number | 14 |
Hermann-Mauguin space group symbol | P 1 21/n 1 |
Hall space group symbol | -P 2yn |
Residual factor for all reflections | 0.0362 |
Residual factor for significantly intense reflections | 0.0336 |
Weighted residual factors for significantly intense reflections | 0.0882 |
Weighted residual factors for all reflections included in the refinement | 0.0903 |
Goodness-of-fit parameter for all reflections included in the refinement | 1.0544 |
Diffraction radiation wavelength | 1.54184 Å |
Diffraction radiation type | CuKα |