Information card for entry 7237836
Formula | C24 H13 F5 N2 O Pt |
Calculated formula | C24 H13 F5 N2 O Pt |
Title of publication | AIPE-active platinum(ii) complexes with tunable photophysical properties and their application in constructing thermosensitive probes used for intracellular temperature imaging |
Authors of publication | Lin, Shengheng; Pan, Honghao; Li, Lin; Liao, Rui; Yu, Shengzhen; Zhao, Qiang; Sun, Huibin; Huang, Wei |
Journal of publication | Journal of Materials Chemistry C |
Year of publication | 2019 |
Journal volume | 7 |
Journal issue | 26 |
Pages of publication | 7893 |
a | 15.764 ± 0.003 Å |
b | 11.846 ± 0.002 Å |
c | 22.623 ± 0.004 Å |
α | 90° |
β | 90° |
γ | 90° |
Cell volume | 4224.6 ± 1.3 Å3 |
Cell temperature | 296 ± 2 K |
Ambient diffraction temperature | 296 ± 2 K |
Number of distinct elements | 6 |
Space group number | 61 |
Hermann-Mauguin space group symbol | P b c a |
Hall space group symbol | -P 2ac 2ab |
Residual factor for all reflections | 0.0519 |
Residual factor for significantly intense reflections | 0.0282 |
Weighted residual factors for significantly intense reflections | 0.0649 |
Weighted residual factors for all reflections included in the refinement | 0.076 |
Goodness-of-fit parameter for all reflections included in the refinement | 0.975 |
Diffraction radiation wavelength | 0.71073 Å |
Diffraction radiation type | MoKα |