Information card for entry 7237841
Formula | C10 H22 Cr N2 Na O12 |
Calculated formula | C10 H22 Cr N2 Na O12 |
SMILES | C(=O)O[Cr](OC=O)(OC=O)(OC=O)(OC=O)OC=O.[Na+].C(C)[NH3+].C([NH3+])C |
Title of publication | Pressure-enhanced ferroelectric polarisation in a polar perovskite-like [C2H5NH3]Na0.5Cr0.5(HCOO)3 metal‒organic framework |
Authors of publication | Ptak, Maciej; Collings, Ines E.; Svane, Katrine L.; Sieradzki, Adam; Paraguassu, Waldeci; Mączka, Mirosław |
Journal of publication | Journal of Materials Chemistry C |
Year of publication | 2019 |
Journal volume | 7 |
Journal issue | 28 |
Pages of publication | 8660 |
a | 8.06 ± 0.0006 Å |
b | 9.0392 ± 0.0007 Å |
c | 11.852 ± 0.009 Å |
α | 90° |
β | 91.018 ± 0.017° |
γ | 90° |
Cell volume | 863.4 ± 0.7 Å3 |
Cell temperature | 293 ± 2 K |
Ambient diffraction temperature | 293 ± 2 K |
Number of distinct elements | 6 |
Space group number | 7 |
Hermann-Mauguin space group symbol | P 1 n 1 |
Hall space group symbol | P -2yac |
Residual factor for all reflections | 0.0631 |
Residual factor for significantly intense reflections | 0.0454 |
Weighted residual factors for significantly intense reflections | 0.0915 |
Weighted residual factors for all reflections included in the refinement | 0.1153 |
Goodness-of-fit parameter for all reflections included in the refinement | 1.136 |
Diffraction radiation wavelength | 0.41134 Å |
Diffraction radiation type | synchrotron |