Information card for entry 7237856
Formula | C69 H60 Cl3 Cu O4 P4 Pt S2 |
Calculated formula | C69 H60 Cl2.98 Cu O4 P4 Pt S2 |
Title of publication | Modulation of the conductance in platinum(ii) bis(acetylide) molecules through “gating” metal ions |
Authors of publication | Duan, Ping; Liu, Junyang; Wang, Jin-Yun; Chen, Lichuan; Wang, Fei; Zhang, Qian-Chong; Hong, Wenjing; Chen, Zhong-Ning |
Journal of publication | Journal of Materials Chemistry C |
Year of publication | 2019 |
Journal volume | 7 |
Journal issue | 24 |
Pages of publication | 7259 |
a | 11.6173 ± 0.0008 Å |
b | 11.6518 ± 0.0008 Å |
c | 24.0238 ± 0.0017 Å |
α | 76.323 ± 0.002° |
β | 87.623 ± 0.003° |
γ | 83.63 ± 0.003° |
Cell volume | 3139.8 ± 0.4 Å3 |
Cell temperature | 100 ± 2 K |
Ambient diffraction temperature | 100 ± 2 K |
Number of distinct elements | 8 |
Space group number | 2 |
Hermann-Mauguin space group symbol | P -1 |
Hall space group symbol | -P 1 |
Residual factor for all reflections | 0.0429 |
Residual factor for significantly intense reflections | 0.0383 |
Weighted residual factors for significantly intense reflections | 0.0957 |
Weighted residual factors for all reflections included in the refinement | 0.1017 |
Goodness-of-fit parameter for all reflections included in the refinement | 1.084 |
Diffraction radiation wavelength | 0.71073 Å |
Diffraction radiation type | MoKα |