Information card for entry 7237875
Formula | C42 H30 F6 N4 O2 |
Calculated formula | C42 H30 F6 N4 O2 |
Title of publication | Salt‒cocrystal continuum for photofunction modulation: stimuli-responsive fluorescence color-tuning of pyridine-modified intramolecular charge-transfer dyes and acid complexes |
Authors of publication | Yano, Yoshio; Ono, Toshikazu; Hatanaka, Sou; Gryko, Daniel T.; Hisaeda, Yoshio |
Journal of publication | Journal of Materials Chemistry C |
Year of publication | 2019 |
Journal volume | 7 |
Journal issue | 29 |
Pages of publication | 8847 |
a | 7.3705 ± 0.0006 Å |
b | 11.0005 ± 0.0012 Å |
c | 12.0029 ± 0.0013 Å |
α | 109.13 ± 0.01° |
β | 106.773 ± 0.008° |
γ | 90.454 ± 0.008° |
Cell volume | 874.66 ± 0.17 Å3 |
Cell temperature | 298 K |
Ambient diffraction temperature | 298 K |
Number of distinct elements | 5 |
Space group number | 2 |
Hermann-Mauguin space group symbol | P -1 |
Hall space group symbol | -P 1 |
Residual factor for all reflections | 0.0733 |
Residual factor for significantly intense reflections | 0.0578 |
Weighted residual factors for significantly intense reflections | 0.1525 |
Weighted residual factors for all reflections included in the refinement | 0.1729 |
Goodness-of-fit parameter for all reflections included in the refinement | 1.067 |
Diffraction radiation probe | x-ray |
Diffraction radiation wavelength | 0.71073 Å |
Diffraction radiation type | MoKα |