Information card for entry 7237882
Formula | C30 H24 N4 |
Calculated formula | C30 H24 N4 |
Title of publication | Salt‒cocrystal continuum for photofunction modulation: stimuli-responsive fluorescence color-tuning of pyridine-modified intramolecular charge-transfer dyes and acid complexes |
Authors of publication | Yano, Yoshio; Ono, Toshikazu; Hatanaka, Sou; Gryko, Daniel T.; Hisaeda, Yoshio |
Journal of publication | Journal of Materials Chemistry C |
Year of publication | 2019 |
Journal volume | 7 |
Journal issue | 29 |
Pages of publication | 8847 |
a | 6.1699 ± 0.0004 Å |
b | 7.2595 ± 0.0005 Å |
c | 13.6139 ± 0.0008 Å |
α | 89.162 ± 0.005° |
β | 79.508 ± 0.005° |
γ | 80.71 ± 0.005° |
Cell volume | 591.64 ± 0.07 Å3 |
Cell temperature | 298 K |
Ambient diffraction temperature | 298 K |
Number of distinct elements | 3 |
Space group number | 2 |
Hermann-Mauguin space group symbol | P -1 |
Hall space group symbol | -P 1 |
Residual factor for all reflections | 0.0492 |
Residual factor for significantly intense reflections | 0.0381 |
Weighted residual factors for significantly intense reflections | 0.1 |
Weighted residual factors for all reflections included in the refinement | 0.1098 |
Goodness-of-fit parameter for all reflections included in the refinement | 1.036 |
Diffraction radiation probe | x-ray |
Diffraction radiation wavelength | 0.71073 Å |
Diffraction radiation type | MoKα |