Information card for entry 7237885
Formula | C44 H30 F6 N4 O4 |
Calculated formula | C44 H30 F6 N4 O4 |
Title of publication | Salt‒cocrystal continuum for photofunction modulation: stimuli-responsive fluorescence color-tuning of pyridine-modified intramolecular charge-transfer dyes and acid complexes |
Authors of publication | Yano, Yoshio; Ono, Toshikazu; Hatanaka, Sou; Gryko, Daniel T.; Hisaeda, Yoshio |
Journal of publication | Journal of Materials Chemistry C |
Year of publication | 2019 |
Journal volume | 7 |
Journal issue | 29 |
Pages of publication | 8847 |
a | 5.9103 ± 0.0005 Å |
b | 18.358 ± 0.002 Å |
c | 17.0558 ± 0.0019 Å |
α | 90° |
β | 92.591 ± 0.009° |
γ | 90° |
Cell volume | 1848.7 ± 0.3 Å3 |
Cell temperature | 123 K |
Ambient diffraction temperature | 123 K |
Number of distinct elements | 5 |
Space group number | 14 |
Hermann-Mauguin space group symbol | P 1 21/c 1 |
Hall space group symbol | -P 2ybc |
Residual factor for all reflections | 0.1866 |
Residual factor for significantly intense reflections | 0.0732 |
Weighted residual factors for significantly intense reflections | 0.1495 |
Weighted residual factors for all reflections included in the refinement | 0.2228 |
Goodness-of-fit parameter for all reflections included in the refinement | 1.007 |
Diffraction radiation probe | x-ray |
Diffraction radiation wavelength | 0.71073 Å |
Diffraction radiation type | MoKα |