Information card for entry 7237887
Formula | C44 H44 N4 O8 S2 |
Calculated formula | C44 H44 N4 O8 S2 |
Title of publication | Salt‒cocrystal continuum for photofunction modulation: stimuli-responsive fluorescence color-tuning of pyridine-modified intramolecular charge-transfer dyes and acid complexes |
Authors of publication | Yano, Yoshio; Ono, Toshikazu; Hatanaka, Sou; Gryko, Daniel T.; Hisaeda, Yoshio |
Journal of publication | Journal of Materials Chemistry C |
Year of publication | 2019 |
Journal volume | 7 |
Journal issue | 29 |
Pages of publication | 8847 |
a | 7.6993 ± 0.0004 Å |
b | 11.1583 ± 0.0009 Å |
c | 11.539 ± 0.001 Å |
α | 89.783 ± 0.007° |
β | 85.718 ± 0.006° |
γ | 84.804 ± 0.005° |
Cell volume | 984.49 ± 0.13 Å3 |
Cell temperature | 123 K |
Ambient diffraction temperature | 123 K |
Number of distinct elements | 5 |
Space group number | 2 |
Hermann-Mauguin space group symbol | P -1 |
Hall space group symbol | -P 1 |
Residual factor for all reflections | 0.0832 |
Residual factor for significantly intense reflections | 0.0543 |
Weighted residual factors for significantly intense reflections | 0.1305 |
Weighted residual factors for all reflections included in the refinement | 0.1547 |
Goodness-of-fit parameter for all reflections included in the refinement | 1.085 |
Diffraction radiation probe | x-ray |
Diffraction radiation wavelength | 0.71073 Å |
Diffraction radiation type | MoKα |