Information card for entry 7237891
Formula | C42 H36 N4 O2 |
Calculated formula | C42 H36 N4 O2 |
Title of publication | Salt‒cocrystal continuum for photofunction modulation: stimuli-responsive fluorescence color-tuning of pyridine-modified intramolecular charge-transfer dyes and acid complexes |
Authors of publication | Yano, Yoshio; Ono, Toshikazu; Hatanaka, Sou; Gryko, Daniel T.; Hisaeda, Yoshio |
Journal of publication | Journal of Materials Chemistry C |
Year of publication | 2019 |
Journal volume | 7 |
Journal issue | 29 |
Pages of publication | 8847 |
a | 8.9338 ± 0.0007 Å |
b | 9.693 ± 0.0008 Å |
c | 10.7136 ± 0.0008 Å |
α | 93.146 ± 0.006° |
β | 90.933 ± 0.006° |
γ | 112.034 ± 0.007° |
Cell volume | 858.01 ± 0.12 Å3 |
Cell temperature | 298 K |
Ambient diffraction temperature | 298 K |
Number of distinct elements | 4 |
Space group number | 2 |
Hermann-Mauguin space group symbol | P -1 |
Hall space group symbol | -P 1 |
Residual factor for all reflections | 0.1062 |
Residual factor for significantly intense reflections | 0.051 |
Weighted residual factors for significantly intense reflections | 0.1114 |
Weighted residual factors for all reflections included in the refinement | 0.142 |
Goodness-of-fit parameter for all reflections included in the refinement | 1.006 |
Diffraction radiation probe | x-ray |
Diffraction radiation wavelength | 0.71073 Å |
Diffraction radiation type | MoKα |