Information card for entry 7237966
Formula | C38 H32 Cd2 N4 O8 |
Calculated formula | C38 H32 Cd2 N4 O8 |
Title of publication | Single-component solid state white-light emission and photoluminescence color tuning of a Cd(ii) complex and its application as a luminescence thermometer |
Authors of publication | Miao, Jinling; Nie, Yong; Li, Yexin; Qin, Chengyuan; Ren, Yifan; Xu, Chunyue; Yan, Meijing; Liu, Kexin; Liu, Guangning |
Journal of publication | Journal of Materials Chemistry C |
Year of publication | 2019 |
Journal volume | 7 |
Journal issue | 43 |
Pages of publication | 13454 |
a | 12.5936 ± 0.0005 Å |
b | 8.8231 ± 0.0003 Å |
c | 16.1379 ± 0.0006 Å |
α | 90° |
β | 99.837 ± 0.004° |
γ | 90° |
Cell volume | 1766.79 ± 0.12 Å3 |
Cell temperature | 293 ± 2 K |
Ambient diffraction temperature | 293.15 K |
Number of distinct elements | 5 |
Space group number | 14 |
Hermann-Mauguin space group symbol | P 1 21/n 1 |
Hall space group symbol | -P 2yn |
Residual factor for all reflections | 0.0561 |
Residual factor for significantly intense reflections | 0.0425 |
Weighted residual factors for significantly intense reflections | 0.0952 |
Weighted residual factors for all reflections included in the refinement | 0.1046 |
Goodness-of-fit parameter for all reflections included in the refinement | 1.032 |
Diffraction radiation probe | x-ray |
Diffraction radiation wavelength | 0.71073 Å |
Diffraction radiation type | MoKα |