Information card for entry 7238041
Formula | C14 H11 F3 N2 O2 |
Calculated formula | C14 H11 F3 N2 O2 |
Title of publication | An investigation of the polymorphism of a potent nonsteroidal anti-inflammatory drug flunixin |
Authors of publication | Liu, Hao; Yang, Xing; Wu, Shanyu; Zhang, Mingtao; Parkin, Sean; Cao, Shuang; Li, Tonglei; Yu, Faquan; Long, Sihui |
Journal of publication | CrystEngComm |
Year of publication | 2020 |
Journal volume | 22 |
Journal issue | 3 |
Pages of publication | 448 - 457 |
a | 7.68546 ± 0.00013 Å |
b | 14.1282 ± 0.0002 Å |
c | 12.49862 ± 0.00017 Å |
α | 90° |
β | 102.16 ± 0.0015° |
γ | 90° |
Cell volume | 1326.67 ± 0.04 Å3 |
Cell temperature | 293 ± 2 K |
Ambient diffraction temperature | 293 ± 2 K |
Number of distinct elements | 5 |
Space group number | 14 |
Hermann-Mauguin space group symbol | P 1 21/c 1 |
Hall space group symbol | -P 2ybc |
Residual factor for all reflections | 0.0446 |
Residual factor for significantly intense reflections | 0.0393 |
Weighted residual factors for significantly intense reflections | 0.1012 |
Weighted residual factors for all reflections included in the refinement | 0.1074 |
Goodness-of-fit parameter for all reflections included in the refinement | 1.034 |
Diffraction radiation probe | x-ray |
Diffraction radiation wavelength | 1.54184 Å |
Diffraction radiation type | CuKα |