Information card for entry 7239071
Formula | C50 H58 N8 Ni O2 S4 |
Calculated formula | C50 H58 N8 Ni O2 S4 |
Title of publication | Importance of alkyl chain-length on the self-assembly of new Ni(qdt)2 complexes and charge transport properties |
Authors of publication | Yang, Xiong-Bo; Zhou, Li; Huang, Long-Biao; Xu, Jia-Ju; Zhou, Ye; Han, Su-Ting; Xu, Zong-Xiang; Lau, Victor C. Y.; Hon-Wah Lam, Micheal; Wong, Wai-Yeung; Roy, V. A. L. |
Journal of publication | RSC Advances |
Year of publication | 2013 |
Journal volume | 3 |
Journal issue | 30 |
Pages of publication | 12075 |
a | 15.263 ± 0.0003 Å |
b | 9.2809 ± 0.0002 Å |
c | 16.8903 ± 0.0003 Å |
α | 90° |
β | 93.097 ± 0.002° |
γ | 90° |
Cell volume | 2389.09 ± 0.08 Å3 |
Cell temperature | 133 ± 2 K |
Ambient diffraction temperature | 133 ± 2 K |
Number of distinct elements | 6 |
Space group number | 14 |
Hermann-Mauguin space group symbol | P 1 21/c 1 |
Hall space group symbol | -P 2ybc |
Residual factor for all reflections | 0.0318 |
Residual factor for significantly intense reflections | 0.0307 |
Weighted residual factors for significantly intense reflections | 0.0849 |
Weighted residual factors for all reflections included in the refinement | 0.0859 |
Goodness-of-fit parameter for all reflections included in the refinement | 1.033 |
Diffraction radiation wavelength | 1.54184 Å |
Diffraction radiation type | CUKα |