Information card for entry 7239148
Formula | C8 H12 Cl Cu2 N6 O14 Tb |
Calculated formula | C8 H8 Cl Cu2 N6 O14 Tb |
Title of publication | A new family of 3d‒4f heterometallic coordination polymers assembled with 1H-1,2,3-triazole-4,5-dicarboxylic acid: syntheses, structures and magnetic properties |
Authors of publication | Zou, Ji-Yong; Xu, Na; Shi, Wei; Gao, Hong-Ling; Cui, Jian-Zhong; Cheng, Peng |
Journal of publication | RSC Advances |
Year of publication | 2013 |
Journal volume | 3 |
Journal issue | 44 |
Pages of publication | 21511 |
a | 11.6342 ± 0.0004 Å |
b | 6.8158 ± 0.0003 Å |
c | 12.1505 ± 0.0004 Å |
α | 90° |
β | 103.834 ± 0.004° |
γ | 90° |
Cell volume | 935.54 ± 0.06 Å3 |
Cell temperature | 293 ± 2 K |
Ambient diffraction temperature | 293 ± 2 K |
Number of distinct elements | 7 |
Space group number | 13 |
Hermann-Mauguin space group symbol | P 1 2/a 1 |
Hall space group symbol | -P 2ya |
Residual factor for all reflections | 0.1036 |
Residual factor for significantly intense reflections | 0.0936 |
Weighted residual factors for significantly intense reflections | 0.257 |
Weighted residual factors for all reflections included in the refinement | 0.2699 |
Goodness-of-fit parameter for all reflections included in the refinement | 1.102 |
Diffraction radiation wavelength | 0.71073 Å |
Diffraction radiation type | MoKα |