Information card for entry 7239631
Formula | C32 H28 N2 O4 |
Calculated formula | C32 H28 N2 O4 |
Title of publication | Novel base-initiated cascade reactions of hemiindigos to produce dipolar γ-carbolines and indole-fused pentacycles |
Authors of publication | Velezheva, V. S.; Babii, O. L.; Khodak, A. A.; Alekseeva, E. A.; Nelyubina, Yu V.; Godovikov, I. A.; Peregudov, A. S.; Majorov, K. B.; Nikonenko, B. V. |
Journal of publication | RSC Advances |
Year of publication | 2019 |
Journal volume | 9 |
Journal issue | 71 |
Pages of publication | 41402 |
a | 8.9151 ± 0.001 Å |
b | 9.6712 ± 0.0011 Å |
c | 15.8118 ± 0.0017 Å |
α | 72.76 ± 0.003° |
β | 83.325 ± 0.003° |
γ | 76.504 ± 0.003° |
Cell volume | 1264.5 ± 0.2 Å3 |
Cell temperature | 120 ± 2 K |
Ambient diffraction temperature | 120.15 K |
Number of distinct elements | 4 |
Space group number | 2 |
Hermann-Mauguin space group symbol | P -1 |
Hall space group symbol | -P 1 |
Residual factor for all reflections | 0.11 |
Residual factor for significantly intense reflections | 0.0592 |
Weighted residual factors for significantly intense reflections | 0.1406 |
Weighted residual factors for all reflections included in the refinement | 0.1645 |
Goodness-of-fit parameter for all reflections included in the refinement | 0.8751 |
Diffraction radiation wavelength | 0.71073 Å |
Diffraction radiation type | MoKα |