Information card for entry 7239635
Formula | C24 H36 K2 N10 O15.25 S2 |
Calculated formula | C24 H31 K2.002 N10 O15.25 S2 |
Title of publication | Metal‒organic architectures driven by a multifunctional 6-aminouracil spacer: structures, noncovalent interactions, and conductivity |
Authors of publication | Purkayastha, Atanu; Dhar, Sourab; Mondal, Suvra Prakash; Franconetti, Antonio; Frontera, Antonio; Ganguly, Rakesh; Kirillov, Alexander M.; Misra, Tarun Kumar |
Journal of publication | CrystEngComm |
Year of publication | 2020 |
Journal volume | 22 |
Journal issue | 4 |
Pages of publication | 829 - 840 |
a | 35.2528 ± 0.0006 Å |
b | 15.7804 ± 0.0003 Å |
c | 13.089 ± 0.0002 Å |
α | 90° |
β | 109.954 ± 0.001° |
γ | 90° |
Cell volume | 6844.3 ± 0.2 Å3 |
Cell temperature | 100 ± 2 K |
Ambient diffraction temperature | 100 ± 2 K |
Number of distinct elements | 6 |
Space group number | 15 |
Hermann-Mauguin space group symbol | C 1 2/c 1 |
Hall space group symbol | -C 2yc |
Residual factor for all reflections | 0.083 |
Residual factor for significantly intense reflections | 0.0474 |
Weighted residual factors for significantly intense reflections | 0.096 |
Weighted residual factors for all reflections included in the refinement | 0.1163 |
Goodness-of-fit parameter for all reflections included in the refinement | 1.062 |
Diffraction radiation wavelength | 0.71073 Å |
Diffraction radiation type | MoKα |