Information card for entry 7239637
Common name | Copper coordination polymer |
Chemical name | Cu-PDA |
Formula | C7 H7 Cu N O6 |
Calculated formula | C7 H7 Cu N O6 |
Title of publication | Polymorphs of a copper coordination compound: interlinking active sites enhance the electrocatalytic activity of the coordination polymer compared to the coordination complex |
Authors of publication | Muthukumar, Pandi; Pannipara, Mehboobali; Al-Sehemi, Abdullah G.; Moon, Dohyun; Anthony, Savarimuthu Philip |
Journal of publication | CrystEngComm |
Year of publication | 2020 |
Journal volume | 22 |
Journal issue | 3 |
Pages of publication | 425 - 429 |
a | 7.207 ± 0.0014 Å |
b | 18.958 ± 0.004 Å |
c | 6.43 ± 0.0013 Å |
α | 90° |
β | 107.09 ± 0.03° |
γ | 90° |
Cell volume | 839.7 ± 0.3 Å3 |
Cell temperature | 220 ± 2 K |
Ambient diffraction temperature | 220 ± 2 K |
Number of distinct elements | 5 |
Space group number | 14 |
Hermann-Mauguin space group symbol | P 1 21/c 1 |
Hall space group symbol | -P 2ybc |
Residual factor for all reflections | 0.0346 |
Residual factor for significantly intense reflections | 0.033 |
Weighted residual factors for significantly intense reflections | 0.0968 |
Weighted residual factors for all reflections included in the refinement | 0.0976 |
Goodness-of-fit parameter for all reflections included in the refinement | 1.122 |
Diffraction radiation wavelength | 0.61 Å |
Diffraction radiation type | synchrotron |