Information card for entry 7239708
Formula | C14 H15 Cl N4 O4 |
Calculated formula | C14 H15 Cl N4 O4 |
Title of publication | Template effect of innocent and coordinating anions on the formation of interpenetrated 2D and 3D networks: methyl orange and iodine sorption studies |
Authors of publication | Baig, Fayaz; Rangan, Krishnan; Eappen, Shibu M.; Mandal, Sanjay K.; Sarkar, Madhushree |
Journal of publication | CrystEngComm |
Year of publication | 2020 |
Journal volume | 22 |
Journal issue | 4 |
Pages of publication | 751 - 766 |
a | 25.482 ± 0.004 Å |
b | 10.5445 ± 0.0013 Å |
c | 11.8015 ± 0.0013 Å |
α | 90° |
β | 90° |
γ | 90° |
Cell volume | 3171 ± 0.7 Å3 |
Cell temperature | 296.15 K |
Ambient diffraction temperature | 296.15 K |
Number of distinct elements | 5 |
Space group number | 43 |
Hermann-Mauguin space group symbol | F d d 2 |
Hall space group symbol | F 2 -2d |
Residual factor for all reflections | 0.1068 |
Residual factor for significantly intense reflections | 0.0887 |
Weighted residual factors for significantly intense reflections | 0.2646 |
Weighted residual factors for all reflections included in the refinement | 0.2899 |
Goodness-of-fit parameter for all reflections included in the refinement | 1.162 |
Diffraction radiation wavelength | 0.71073 Å |
Diffraction radiation type | MoKα |