Information card for entry 7239712
Formula | C35 H40 Cd N8 O9 S2 |
Calculated formula | C34 H32 Cd N8 O6 S2 |
Title of publication | Template effect of innocent and coordinating anions on the formation of interpenetrated 2D and 3D networks: methyl orange and iodine sorption studies |
Authors of publication | Baig, Fayaz; Rangan, Krishnan; Eappen, Shibu M.; Mandal, Sanjay K.; Sarkar, Madhushree |
Journal of publication | CrystEngComm |
Year of publication | 2020 |
Journal volume | 22 |
Journal issue | 4 |
Pages of publication | 751 - 766 |
a | 9.8572 ± 0.0005 Å |
b | 14.2441 ± 0.0007 Å |
c | 15.6512 ± 0.0009 Å |
α | 96.235 ± 0.004° |
β | 94.357 ± 0.004° |
γ | 100.569 ± 0.004° |
Cell volume | 2137.1 ± 0.2 Å3 |
Cell temperature | 293.15 K |
Ambient diffraction temperature | 293.15 K |
Number of distinct elements | 6 |
Space group number | 2 |
Hermann-Mauguin space group symbol | P -1 |
Hall space group symbol | -P 1 |
Residual factor for all reflections | 0.075 |
Residual factor for significantly intense reflections | 0.063 |
Weighted residual factors for significantly intense reflections | 0.1472 |
Weighted residual factors for all reflections included in the refinement | 0.1511 |
Goodness-of-fit parameter for all reflections included in the refinement | 1.108 |
Diffraction radiation wavelength | 0.71073 Å |
Diffraction radiation type | MoKα |