Information card for entry 7239718
Formula | C32 H80 Gd9 N16 O50 |
Calculated formula | C32 H80 Gd9 N16 O50 |
Title of publication | Manipulating clusters by regulating N,O chelating ligands: structures and multistep assembly mechanisms |
Authors of publication | Wang, Hai-Ling; Liu, Zi-Yuan; Zhu, Zhong-Hong; Peng, Jin-Mei; Ma, Xiong-Feng; Bai, Juan; Zou, Hua-Hong; Mo, Kai-Qiang; Liang, Fu-Pei |
Journal of publication | CrystEngComm |
Year of publication | 2020 |
Journal volume | 22 |
Journal issue | 5 |
Pages of publication | 915 - 923 |
a | 17.3 ± 0.0002 Å |
b | 17.3 ± 0.0002 Å |
c | 14.446 ± 0.0003 Å |
α | 90° |
β | 90° |
γ | 90° |
Cell volume | 4323.54 ± 0.11 Å3 |
Cell temperature | 293 ± 2 K |
Ambient diffraction temperature | 293 ± 2 K |
Number of distinct elements | 5 |
Space group number | 104 |
Hermann-Mauguin space group symbol | P 4 n c |
Hall space group symbol | P 4 -2n |
Residual factor for all reflections | 0.0253 |
Residual factor for significantly intense reflections | 0.0236 |
Weighted residual factors for significantly intense reflections | 0.0563 |
Weighted residual factors for all reflections included in the refinement | 0.0573 |
Goodness-of-fit parameter for all reflections included in the refinement | 1.033 |
Diffraction radiation wavelength | 0.71073 Å |
Diffraction radiation type | MoKα |