Information card for entry 7239864
Formula | C4.17 H2.67 Co0.17 N0.33 O1.17 S0.17 |
Calculated formula | C4.16667 H2 Co0.166667 N0.333333 O1.16667 S0.166667 |
Title of publication | Assembly of four new cobalt coordination polymers modulated by N-coligands: sensitive and selective sensing of nitroaromatics, Fe3+ and Cr2O72− in water |
Authors of publication | Tu, Qian-Qian; Ren, Ling-Ling; Cui, Ying-Ying; Cheng, Ai-Ling; Gao, En-Qing |
Journal of publication | CrystEngComm |
Year of publication | 2020 |
Journal volume | 22 |
Journal issue | 10 |
Pages of publication | 1789 - 1801 |
a | 17.876 ± 0.002 Å |
b | 27.491 ± 0.002 Å |
c | 11.3809 ± 0.001 Å |
α | 90° |
β | 90° |
γ | 90° |
Cell volume | 5592.9 ± 0.9 Å3 |
Cell temperature | 293 ± 2 K |
Ambient diffraction temperature | 293 ± 2 K |
Number of distinct elements | 6 |
Space group number | 55 |
Hermann-Mauguin space group symbol | P b a m |
Hall space group symbol | -P 2 2ab |
Residual factor for all reflections | 0.186 |
Residual factor for significantly intense reflections | 0.0848 |
Weighted residual factors for significantly intense reflections | 0.2211 |
Weighted residual factors for all reflections included in the refinement | 0.2735 |
Goodness-of-fit parameter for all reflections included in the refinement | 0.931 |
Diffraction radiation wavelength | 1.54184 Å |
Diffraction radiation type | CuKα |