Information card for entry 7240257
Formula | C10 H58 Cu4 N10 O48 Si W11 |
Calculated formula | C10 H40 Cu4 N10 O47 Si W11 |
Title of publication | Application of temperature-controlled chiral hybrid structures constructed from copper(ii)-monosubstituted Keggin polyoxoanions and copper(ii)-organoamine complexes in enantioselective sensing of tartaric acid |
Authors of publication | Yang, Mu-Xiu; Zhou, Meng-Jie; Cao, Jia-Peng; Han, Ye-Min; Hong, Ya-Lin; Xu, Yan |
Journal of publication | RSC Advances |
Year of publication | 2020 |
Journal volume | 10 |
Journal issue | 23 |
Pages of publication | 13759 - 13765 |
a | 10.97 ± 0.004 Å |
b | 12.408 ± 0.004 Å |
c | 12.818 ± 0.004 Å |
α | 101.383 ± 0.004° |
β | 111.028 ± 0.004° |
γ | 108.089 ± 0.004° |
Cell volume | 1451.3 ± 0.8 Å3 |
Cell temperature | 296 ± 2 K |
Ambient diffraction temperature | 296 ± 2 K |
Number of distinct elements | 7 |
Space group number | 1 |
Hermann-Mauguin space group symbol | P 1 |
Hall space group symbol | P 1 |
Residual factor for all reflections | 0.0565 |
Residual factor for significantly intense reflections | 0.0517 |
Weighted residual factors for significantly intense reflections | 0.1249 |
Weighted residual factors for all reflections included in the refinement | 0.1356 |
Goodness-of-fit parameter for all reflections included in the refinement | 1.029 |
Diffraction radiation wavelength | 0.71073 Å |
Diffraction radiation type | MoKα |