Information card for entry 7240627
Formula | C19 H17 N S2 |
Calculated formula | C19 H17 N S2 |
Title of publication | Palladium nanoparticles immobilized on a nano-silica triazine dendritic polymer: a recyclable and sustainable nanoreactor for C‒S cross-coupling |
Authors of publication | Landarani-Isfahani, Amir; Mohammadpoor-Baltork, Iraj; Mirkhani, Valiollah; Moghadam, Majid; Tangestaninejad, Shahram; Amiri Rudbari, Hadi |
Journal of publication | RSC Advances |
Year of publication | 2020 |
Journal volume | 10 |
Journal issue | 36 |
Pages of publication | 21198 - 21205 |
a | 12.837 ± 0.003 Å |
b | 8.8654 ± 0.0018 Å |
c | 15.322 ± 0.003 Å |
α | 90° |
β | 105.87 ± 0.03° |
γ | 90° |
Cell volume | 1677.3 ± 0.7 Å3 |
Cell temperature | 298 ± 2 K |
Ambient diffraction temperature | 298 ± 2 K |
Number of distinct elements | 4 |
Space group number | 15 |
Hermann-Mauguin space group symbol | C 1 2/c 1 |
Hall space group symbol | -C 2yc |
Residual factor for all reflections | 0.1915 |
Residual factor for significantly intense reflections | 0.1168 |
Weighted residual factors for significantly intense reflections | 0.1411 |
Weighted residual factors for all reflections included in the refinement | 0.1602 |
Goodness-of-fit parameter for all reflections included in the refinement | 1.215 |
Diffraction radiation wavelength | 0.71073 Å |
Diffraction radiation type | MoKα |