Information card for entry 7240754
Chemical name | dihydraine tetranitroethide |
Formula | C2 H10 N8 O8 |
Calculated formula | C2 H10 N8 O8 |
Title of publication | A new oxygen-rich energetic salt dihydrazine tetranitroethide: a promising explosive alternative with high density and good performance |
Authors of publication | Mei, Haozheng; Yang, Junqing; Cao, Wenli; Hu, Yong; He, Piao; Zhang, Jian-Guo |
Journal of publication | RSC Advances |
Year of publication | 2020 |
Journal volume | 10 |
Journal issue | 39 |
Pages of publication | 23250 - 23253 |
a | 16.946 ± 0.003 Å |
b | 9.3354 ± 0.0019 Å |
c | 14.414 ± 0.003 Å |
α | 90° |
β | 120.28 ± 0.03° |
γ | 90° |
Cell volume | 1969.2 ± 0.9 Å3 |
Cell temperature | 153 ± 2 K |
Ambient diffraction temperature | 153.15 K |
Number of distinct elements | 4 |
Space group number | 15 |
Hermann-Mauguin space group symbol | C 1 2/c 1 |
Hall space group symbol | -C 2yc |
Residual factor for all reflections | 0.0595 |
Residual factor for significantly intense reflections | 0.0511 |
Weighted residual factors for significantly intense reflections | 0.1176 |
Weighted residual factors for all reflections included in the refinement | 0.1236 |
Goodness-of-fit parameter for all reflections included in the refinement | 1.12 |
Diffraction radiation wavelength | 0.71073 Å |
Diffraction radiation type | MoKα |