Information card for entry 7240907
Formula |
C68 H76 O24 Ti7 |
Calculated formula |
C68 H76 O24 Ti7 |
Title of publication |
Calix[8]arene-constructed stable polyoxo-titanium clusters for efficient CO2 photoreduction |
Authors of publication |
Li, Ning; Liu, Jing-Jing; Sun, Jia-Wei; Dong, Bao-Xia; Dong, Long-Zhang; Yao, Su-Juan; Xin, Zhifeng; Li, Shun-Li; Lan, Ya-Qian |
Journal of publication |
Green Chemistry |
Year of publication |
2020 |
Journal volume |
22 |
Journal issue |
16 |
Pages of publication |
5325 - 5332 |
a |
24.63 ± 0.03 Å |
b |
19.1 ± 0.03 Å |
c |
14.9 ± 0.02 Å |
α |
90° |
β |
90° |
γ |
90° |
Cell volume |
7009 ± 17 Å3 |
Cell temperature |
296.15 K |
Ambient diffraction temperature |
296.15 K |
Number of distinct elements |
4 |
Space group number |
36 |
Hermann-Mauguin space group symbol |
C m c 21 |
Hall space group symbol |
C 2c -2 |
Residual factor for all reflections |
0.1629 |
Residual factor for significantly intense reflections |
0.0852 |
Weighted residual factors for significantly intense reflections |
0.169 |
Weighted residual factors for all reflections included in the refinement |
0.2079 |
Goodness-of-fit parameter for all reflections included in the refinement |
1.122 |
Diffraction radiation wavelength |
0.71073 Å |
Diffraction radiation type |
MoKα |
Yes |
Yes |
No |