Information card for entry 7240916
Chemical name | (E)-N-benzyl-N-(3-oxo-1,3-diphenylprop-1-en-1-yl)acetamide |
Formula | C24 H21 N O2 |
Calculated formula | C24 H21 N O2 |
SMILES | O=C(N(/C(=C/C(=O)c1ccccc1)c1ccccc1)Cc1ccccc1)C |
Title of publication | Regio- and stereoselective C(sp2)‒H acylation of enamides with aldehydes via transition-metal-free photoredox catalysis |
Authors of publication | Zhao, Kai; Zhang, Xiao-Chen; Tao, Ji-Yu; Wu, Xian-Dan; Wu, Jia-Xu; Li, Wei-Ming; Zhu, Tong-Hao; Loh, Teck-Peng |
Journal of publication | Green Chemistry |
Year of publication | 2020 |
Journal volume | 22 |
Journal issue | 16 |
Pages of publication | 5497 - 5503 |
a | 9.1551 ± 0.0002 Å |
b | 11.365 ± 0.0002 Å |
c | 18.1448 ± 0.0004 Å |
α | 90° |
β | 94.124 ± 0.001° |
γ | 90° |
Cell volume | 1883.04 ± 0.07 Å3 |
Cell temperature | 124 ± 2 K |
Ambient diffraction temperature | 124.58 K |
Number of distinct elements | 4 |
Space group number | 14 |
Hermann-Mauguin space group symbol | P 1 21/c 1 |
Hall space group symbol | -P 2ybc |
Residual factor for all reflections | 0.0497 |
Residual factor for significantly intense reflections | 0.0385 |
Weighted residual factors for significantly intense reflections | 0.089 |
Weighted residual factors for all reflections included in the refinement | 0.0961 |
Goodness-of-fit parameter for all reflections included in the refinement | 1.07 |
Diffraction radiation wavelength | 1.34139 Å |
Diffraction radiation type | GaKα |