Information card for entry 7240982
Chemical name | 4-amino-2-methoxybenzoic acid |
Formula | C8 H9 N O3 |
Calculated formula | C8 H9 N O3 |
SMILES | O(c1c(ccc(N)c1)C(=O)O)C |
Title of publication | Can solvated intermediates inform us about nucleation pathways? The case of β-pABA |
Authors of publication | Cruz-Cabeza, A. J.; Taylor, E.; Sugden, I. J.; Bowskill, D. H.; Wright, S. E.; Abdullahi, H.; Tulegenov, D.; Sadiq, G.; Davey, R. J. |
Journal of publication | CrystEngComm |
Year of publication | 2020 |
a | 8.1846 ± 0.0007 Å |
b | 13.5952 ± 0.001 Å |
c | 7.2087 ± 0.0006 Å |
α | 90° |
β | 109.909 ± 0.01° |
γ | 90° |
Cell volume | 754.18 ± 0.12 Å3 |
Cell temperature | 150 K |
Ambient diffraction temperature | 150 K |
Number of distinct elements | 4 |
Space group number | 14 |
Hermann-Mauguin space group symbol | P 1 21/c 1 |
Hall space group symbol | -P 2ybc |
Residual factor for all reflections | 0.0909 |
Residual factor for significantly intense reflections | 0.0532 |
Weighted residual factors for significantly intense reflections | 0.1132 |
Weighted residual factors for all reflections included in the refinement | 0.1382 |
Goodness-of-fit parameter for all reflections included in the refinement | 1.03 |
Diffraction radiation probe | x-ray |
Diffraction radiation wavelength | 0.71073 Å |
Diffraction radiation type | MoKα |