Information card for entry 7241013
Formula | C60 H136 Co2 N8 O12 S4 Si4 |
Calculated formula | C60 H136 Co2 N8 O12 S4 Si4 |
Title of publication | Novel tetrahedral cobalt(ii) silanethiolates: structures and magnetism |
Authors of publication | Kowalkowska-Zedler, Daria; Nedelko, Natalia; Kazimierczuk, Katarzyna; Aleshkevych, Pavlo; Łyszczek, Renata; Ślawska-Waniewska, Anna; Pladzyk, Agnieszka |
Journal of publication | RSC Advances |
Year of publication | 2020 |
Journal volume | 10 |
Journal issue | 49 |
Pages of publication | 29100 - 29108 |
a | 10.491 ± 0.0007 Å |
b | 14.8834 ± 0.001 Å |
c | 15.4659 ± 0.001 Å |
α | 115.059 ± 0.005° |
β | 90.642 ± 0.005° |
γ | 94.524 ± 0.006° |
Cell volume | 2178.1 ± 0.3 Å3 |
Cell temperature | 120 ± 2 K |
Ambient diffraction temperature | 120 ± 2 K |
Number of distinct elements | 7 |
Space group number | 2 |
Hermann-Mauguin space group symbol | P -1 |
Hall space group symbol | -P 1 |
Residual factor for all reflections | 0.1025 |
Residual factor for significantly intense reflections | 0.0558 |
Weighted residual factors for significantly intense reflections | 0.1428 |
Weighted residual factors for all reflections included in the refinement | 0.2017 |
Goodness-of-fit parameter for all reflections included in the refinement | 1.048 |
Diffraction radiation probe | x-ray |
Diffraction radiation wavelength | 0.71073 Å |
Diffraction radiation type | MoKα |