Information card for entry 7241360
Formula | C114 H101 Dy12 N20 O58 |
Calculated formula | C114 H101 Dy12 N20 O58 |
Title of publication | Lanthanide(III) Dodecanuclear Structure with Acylyhydrazone Schiff-base Ligand: Slow Magnetic Relaxation and Magnetocaloric Effects |
Authors of publication | Wang, Wei; Zhang, Jing; Zhao, Ji-Hai; He, Yuan-Chun; Li, Meng-Ting; Yu, Yang |
Journal of publication | CrystEngComm |
Year of publication | 2020 |
a | 16.8431 ± 0.0004 Å |
b | 44.1352 ± 0.0007 Å |
c | 27.1376 ± 0.0006 Å |
α | 90° |
β | 107.142 ± 0.002° |
γ | 90° |
Cell volume | 19277.2 ± 0.7 Å3 |
Cell temperature | 293 ± 2 K |
Ambient diffraction temperature | 293 ± 2 K |
Number of distinct elements | 5 |
Space group number | 15 |
Hermann-Mauguin space group symbol | C 1 2/c 1 |
Hall space group symbol | -C 2yc |
Residual factor for all reflections | 0.0358 |
Residual factor for significantly intense reflections | 0.0298 |
Weighted residual factors for significantly intense reflections | 0.1046 |
Weighted residual factors for all reflections included in the refinement | 0.1091 |
Goodness-of-fit parameter for all reflections included in the refinement | 1.148 |
Diffraction radiation probe | x-ray |
Diffraction radiation wavelength | 0.71073 Å |
Diffraction radiation type | MoKα |
Duplicate of | 7241359 |