Information card for entry 7241418
Formula | C23 H23 Br Cl3 N7 O |
Calculated formula | C23 H23 Br Cl3 N7 O |
Title of publication | Synthesis, study of antileishmanial and antitrypanosomal activity of imidazo pyridine fused triazole analogues |
Authors of publication | Nandikolla, Adinarayana; Srinivasarao, Singireddi; Karan Kumar, Banoth; Murugesan, Sankaranarayanan; Aggarwal, Himanshu; Major, Louise L.; Smith, Terry K.; Chandra Sekhar, Kondapalli Venkata Gowri |
Journal of publication | RSC Advances |
Year of publication | 2020 |
Journal volume | 10 |
Journal issue | 63 |
Pages of publication | 38328 - 38343 |
a | 17.2953 ± 0.0007 Å |
b | 13.8502 ± 0.0005 Å |
c | 20.9305 ± 0.0007 Å |
α | 90° |
β | 90° |
γ | 90° |
Cell volume | 5013.8 ± 0.3 Å3 |
Cell temperature | 100 K |
Ambient diffraction temperature | 100 K |
Number of distinct elements | 6 |
Space group number | 61 |
Hermann-Mauguin space group symbol | P b c a |
Hall space group symbol | -P 2ac 2ab |
Residual factor for all reflections | 0.0411 |
Residual factor for significantly intense reflections | 0.0292 |
Weighted residual factors for significantly intense reflections | 0.0725 |
Weighted residual factors for all reflections included in the refinement | 0.0791 |
Goodness-of-fit parameter for all reflections included in the refinement | 1.0393 |
Diffraction radiation probe | x-ray |
Diffraction radiation wavelength | 0.71073 Å |
Diffraction radiation type | MoKα |