Information card for entry 7241539
Formula
C76 H111 Ge12 N16 O84 Pr11
Calculated formula
C76 H72 Ge12 N16 O80 Pr11
Title of publication
Construction of high-nuclear 4p‒4f heterometallic {Ln11Ge12} cluster-organic frameworks with high-sensitivity luminescence sensing of Fe3+ in aqueous solution
Authors of publication
Li, Leilei; Cai, Bin; Pang, Donghui; Du, Xinxin; Yin, Xingliang; Wang, Huaiwei; Yang, Jie; Li, Dacheng; Dou, Jianmin
Journal of publication
CrystEngComm
Year of publication
2020
a
27.515 ± 0.007 Å
b
19.112 ± 0.005 Å
c
27.087 ± 0.007 Å
α
90°
β
102.745 ± 0.003°
γ
90°
Cell volume
13893 ± 6 Å3
Cell temperature
298 ± 2 K
Ambient diffraction temperature
298 ± 2 K
Number of distinct elements
6
Space group number
9
Hermann-Mauguin space group symbol
C 1 c 1
Hall space group symbol
C -2yc
Residual factor for all reflections
0.0715
Residual factor for significantly intense reflections
0.0503
Weighted residual factors for significantly intense reflections
0.1263
Weighted residual factors for all reflections included in the refinement
0.1416
Goodness-of-fit parameter for all reflections included in the refinement
1.007
Diffraction radiation wavelength
0.71073 Å
Diffraction radiation type
MoKα
Yes
No
No