Information card for entry 7241541
Formula | C16 H14 Cu2 I2 N2 S2 |
Calculated formula | C16 H14 Cu2 I2 N2 S2 |
Title of publication | Copper(i) halide cluster-based coordination polymers modulated by chiral ditopic dithiodianthranilide ligands: synthesis, crystal structure and photoluminescence |
Authors of publication | Chojnacki, Jarosław; Mońka, Michał; Serdiuk, Illia E.; Bojarski, Piotr; Połoński, Tadeusz; Olszewska, Teresa |
Journal of publication | CrystEngComm |
Year of publication | 2021 |
Journal volume | 23 |
Journal issue | 2 |
Pages of publication | 299 - 307 |
a | 13.353 ± 0.003 Å |
b | 10.6593 ± 0.0016 Å |
c | 13.978 ± 0.003 Å |
α | 90° |
β | 101.058 ± 0.016° |
γ | 90° |
Cell volume | 1952.6 ± 0.7 Å3 |
Cell temperature | 120 ± 2 K |
Ambient diffraction temperature | 120 K |
Number of distinct elements | 6 |
Space group number | 14 |
Hermann-Mauguin space group symbol | P 1 21/n 1 |
Hall space group symbol | -P 2yn |
Residual factor for all reflections | 0.0469 |
Residual factor for significantly intense reflections | 0.0418 |
Weighted residual factors for significantly intense reflections | 0.1066 |
Weighted residual factors for all reflections included in the refinement | 0.1102 |
Goodness-of-fit parameter for all reflections included in the refinement | 1.004 |
Diffraction radiation wavelength | 0.71073 Å |
Diffraction radiation type | MoKα |