Information card for entry 7241726
Formula | C28 H24 N12 O17 S2 Sr |
Calculated formula | C28 H24 N12 O17 S2 Sr |
Title of publication | Assemblies of cucurbit[6]uril-based coordination complexes with disulfonate ligands: from discrete complexes to one- and two-dimensional polymers |
Authors of publication | Chen, Kai; Hua, Zi-Yi; Li, Ran; Peng, Yu-Ying; Zhu, Qiang Zhao; Zhao, Jiang-Lin; Redshaw, Carl |
Journal of publication | CrystEngComm |
Year of publication | 2021 |
Journal volume | 23 |
Journal issue | 2 |
Pages of publication | 465 - 481 |
a | 10.714 ± 0.005 Å |
b | 14.407 ± 0.005 Å |
c | 15.63 ± 0.005 Å |
α | 65.529 ± 0.005° |
β | 73.674 ± 0.005° |
γ | 86.24 ± 0.005° |
Cell volume | 2103.8 ± 1.4 Å3 |
Cell temperature | 293 ± 2 K |
Ambient diffraction temperature | 293 ± 2 K |
Number of distinct elements | 6 |
Space group number | 2 |
Hermann-Mauguin space group symbol | P -1 |
Hall space group symbol | -P 1 |
Residual factor for all reflections | 0.0559 |
Residual factor for significantly intense reflections | 0.0437 |
Weighted residual factors for significantly intense reflections | 0.1189 |
Weighted residual factors for all reflections included in the refinement | 0.1247 |
Goodness-of-fit parameter for all reflections included in the refinement | 1.024 |
Diffraction radiation wavelength | 0.71069 Å |
Diffraction radiation type | MoKα |