Information card for entry 7241807
Formula | C43.25 H49.25 N3.75 O11.75 Zn2.5 |
Calculated formula | C43.25 H49.25 N3.75 O11.75 Zn2.5 |
Title of publication | Crystal engineering of coordination polymers using flexible tetracarboxylate linkers with embedded cyclohexyldiamine cores |
Authors of publication | Chahine, Ali Y.; Turner, David R.; Batten, Stuart R. |
Journal of publication | CrystEngComm |
Year of publication | 2021 |
Journal volume | 23 |
Journal issue | 3 |
Pages of publication | 569 - 590 |
a | 20.8995 ± 0.0002 Å |
b | 21.0392 ± 0.0002 Å |
c | 32.8802 ± 0.0003 Å |
α | 90° |
β | 94.498 ± 0.001° |
γ | 90° |
Cell volume | 14413.2 ± 0.2 Å3 |
Cell temperature | 123 ± 2 K |
Ambient diffraction temperature | 123 ± 2 K |
Number of distinct elements | 5 |
Space group number | 15 |
Hermann-Mauguin space group symbol | C 1 2/c 1 |
Hall space group symbol | -C 2yc |
Residual factor for all reflections | 0.0723 |
Residual factor for significantly intense reflections | 0.0662 |
Weighted residual factors for significantly intense reflections | 0.2134 |
Weighted residual factors for all reflections included in the refinement | 0.2197 |
Goodness-of-fit parameter for all reflections included in the refinement | 1.081 |
Diffraction radiation wavelength | 1.54184 Å |
Diffraction radiation type | CuKα |