Information card for entry 7241817
Formula | C56 H56 Cl4 Cu4 N8 O28 |
Calculated formula | C56 H56 Cl4 Cu4 N8 O28 |
Title of publication | One-pot crystallization of two 1,4-cyclohexanedicarboxylate-based tetranuclear Cu(ii) compounds and their DNA binding affinities |
Authors of publication | Akhtaruzzaman,; Mohammad, Mukti; Khan, Samim; Dutta, Basudeb; Maity, Suvendu; Naaz, Sanobar; Alam, Seikh Mafiz; Ghosh, Prasanta; Islam, Md. Maidul; Mir, Mohammad Hedayetullah |
Journal of publication | CrystEngComm |
Year of publication | 2021 |
Journal volume | 23 |
Journal issue | 5 |
Pages of publication | 1091 - 1098 |
a | 9.5466 ± 0.0003 Å |
b | 17.6942 ± 0.0006 Å |
c | 20.2248 ± 0.0007 Å |
α | 90° |
β | 101.2 ± 0.002° |
γ | 90° |
Cell volume | 3351.3 ± 0.19 Å3 |
Cell temperature | 298 ± 2 K |
Ambient diffraction temperature | 298 ± 2 K |
Number of distinct elements | 6 |
Space group number | 14 |
Hermann-Mauguin space group symbol | P 1 21/n 1 |
Hall space group symbol | -P 2yn |
Residual factor for all reflections | 0.0759 |
Residual factor for significantly intense reflections | 0.0533 |
Weighted residual factors for significantly intense reflections | 0.1524 |
Weighted residual factors for all reflections included in the refinement | 0.1787 |
Goodness-of-fit parameter for all reflections included in the refinement | 1.052 |
Diffraction radiation wavelength | 0.71073 Å |
Diffraction radiation type | MoKα |