Information card for entry 7241856
Common name | claudetite I |
Formula | As2 O3 |
Calculated formula | As2 O3 |
Title of publication | High-pressure and low-temperature structural study of claudetite I, a monoclinic layered As2O3 polymorph |
Authors of publication | Guńka, Piotr A.; Hanfland, Michael; Chen, Yu-Sheng; Zachara, Janusz |
Journal of publication | CrystEngComm |
Year of publication | 2021 |
Journal volume | 23 |
Journal issue | 3 |
Pages of publication | 638 - 644 |
a | 5.28841 ± 0.00013 Å |
b | 12.8335 ± 0.0003 Å |
c | 4.50014 ± 0.00013 Å |
α | 90° |
β | 94.541 ± 0.003° |
γ | 90° |
Cell volume | 304.46 ± 0.014 Å3 |
Cell temperature | 150 ± 1 K |
Ambient diffraction temperature | 150 ± 1 K |
Number of distinct elements | 2 |
Space group number | 14 |
Hermann-Mauguin space group symbol | P 1 21/n 1 |
Hall space group symbol | -P 2yn |
Residual factor for all reflections | 0.0377 |
Residual factor for significantly intense reflections | 0.0314 |
Weighted residual factors for significantly intense reflections | 0.0779 |
Weighted residual factors for all reflections included in the refinement | 0.0821 |
Goodness-of-fit parameter for all reflections included in the refinement | 1.063 |
Diffraction radiation probe | x-ray |
Diffraction radiation wavelength | 0.41328 Å |
Diffraction radiation type | synchrotron |