Information card for entry 7241866
Common name | [Tb(C12N2H8)4(C3N4H3O2)2(Cl)2](ClO4)2 |
Chemical name | '[Tb(C12N2H8)4(C3N4H3O2)2(Cl)2](ClO4)2' |
Formula | C54 H38 Cl4 N16 O12 Tb2 |
Calculated formula | C54 H38 Cl4 N16 O12 Tb2 |
Title of publication | A new family of dinuclear lanthanide complexes exhibiting luminescence, magnetic entropy changes and single molecule magnet behaviors |
Authors of publication | Dong, Lu; Lu, Ying-Bing; Zhu, Shui-Dong; Wu, Jun-Wei; Zhang, Xin-Ting; Liao, Yi; Liu, Cai-Ming; Liu, Sui-Jun; Xie, Yong-Rong; Zhang, Shi-Yong |
Journal of publication | CrystEngComm |
Year of publication | 2021 |
Journal volume | 23 |
Journal issue | 3 |
Pages of publication | 645 - 652 |
a | 12.0288 ± 0.0004 Å |
b | 11.6329 ± 0.0003 Å |
c | 21.7452 ± 0.0006 Å |
α | 90° |
β | 94.488 ± 0.001° |
γ | 90° |
Cell volume | 3033.47 ± 0.15 Å3 |
Cell temperature | 293 ± 2 K |
Ambient diffraction temperature | 293 ± 2 K |
Number of distinct elements | 6 |
Space group number | 14 |
Hermann-Mauguin space group symbol | P 1 21/n 1 |
Hall space group symbol | -P 2yn |
Residual factor for all reflections | 0.0413 |
Residual factor for significantly intense reflections | 0.0324 |
Weighted residual factors for significantly intense reflections | 0.0789 |
Weighted residual factors for all reflections included in the refinement | 0.0849 |
Goodness-of-fit parameter for all reflections included in the refinement | 1.011 |
Diffraction radiation wavelength | 0.71073 Å |
Diffraction radiation type | MoKα |