Information card for entry 7241870
Formula | H10 Ni O15 S1.38 Se0.62 U |
Calculated formula | H10 Ni O15 S1.379 Se0.621 U |
Title of publication | Crystal chemistry of the M2+[(UO2)(T6+O4)2(H2O)](H2O)4 (M2+ = Mg, Mn, Fe, Co, Ni and Zn; T6+ = S, Se) compounds: the interplay between chemical composition, pH and structural architecture |
Authors of publication | Kornyakov, Ilya V.; Tyumentseva, Olga S.; Krivovichev, Sergey V.; Tananaev, Ivan G.; Gurzhiy, Vladislav V. |
Journal of publication | CrystEngComm |
Year of publication | 2021 |
Journal volume | 23 |
Journal issue | 5 |
Pages of publication | 1140 - 1148 |
a | 12.8182 ± 0.0002 Å |
b | 8.2926 ± 0.0002 Å |
c | 11.3803 ± 0.0002 Å |
α | 90° |
β | 90° |
γ | 90° |
Cell volume | 1209.68 ± 0.04 Å3 |
Cell temperature | 100 ± 2 K |
Ambient diffraction temperature | 100 ± 2 K |
Number of distinct elements | 6 |
Space group number | 31 |
Hermann-Mauguin space group symbol | P m n 21 |
Hall space group symbol | P 2ac -2 |
Residual factor for all reflections | 0.0208 |
Residual factor for significantly intense reflections | 0.018 |
Weighted residual factors for significantly intense reflections | 0.0414 |
Weighted residual factors for all reflections included in the refinement | 0.0437 |
Goodness-of-fit parameter for all reflections included in the refinement | 1.057 |
Diffraction radiation probe | x-ray |
Diffraction radiation wavelength | 0.71073 Å |
Diffraction radiation type | MoKα |