Information card for entry 7241874
Formula | H10 Ni O15 S2 U |
Calculated formula | H10 Ni O15 S2 U |
Title of publication | Crystal chemistry of the M2+[(UO2)(T6+O4)2(H2O)](H2O)4 (M2+ = Mg, Mn, Fe, Co, Ni and Zn; T6+ = S, Se) compounds: the interplay between chemical composition, pH and structural architecture |
Authors of publication | Kornyakov, Ilya V.; Tyumentseva, Olga S.; Krivovichev, Sergey V.; Tananaev, Ivan G.; Gurzhiy, Vladislav V. |
Journal of publication | CrystEngComm |
Year of publication | 2021 |
Journal volume | 23 |
Journal issue | 5 |
Pages of publication | 1140 - 1148 |
a | 12.7506 ± 0.0001 Å |
b | 8.3095 ± 0.0001 Å |
c | 11.2929 ± 0.0001 Å |
α | 90° |
β | 90° |
γ | 90° |
Cell volume | 1196.5 ± 0.02 Å3 |
Cell temperature | 296 ± 2 K |
Ambient diffraction temperature | 296 ± 2 K |
Number of distinct elements | 5 |
Space group number | 31 |
Hermann-Mauguin space group symbol | P m n 21 |
Hall space group symbol | P 2ac -2 |
Residual factor for all reflections | 0.0282 |
Residual factor for significantly intense reflections | 0.0277 |
Weighted residual factors for significantly intense reflections | 0.0752 |
Weighted residual factors for all reflections included in the refinement | 0.0758 |
Goodness-of-fit parameter for all reflections included in the refinement | 1.128 |
Diffraction radiation probe | x-ray |
Diffraction radiation wavelength | 0.71073 Å |
Diffraction radiation type | MoKα |