Information card for entry 7241878
Formula | H10 Ni O15 S0.22 Se1.78 U |
Calculated formula | H10 Ni O15 S0.216 Se1.784 U |
Title of publication | Crystal chemistry of the M2+[(UO2)(T6+O4)2(H2O)](H2O)4 (M2+ = Mg, Mn, Fe, Co, Ni and Zn; T6+ = S, Se) compounds: the interplay between chemical composition, pH and structural architecture |
Authors of publication | Kornyakov, Ilya V.; Tyumentseva, Olga S.; Krivovichev, Sergey V.; Tananaev, Ivan G.; Gurzhiy, Vladislav V. |
Journal of publication | CrystEngComm |
Year of publication | 2021 |
Journal volume | 23 |
Journal issue | 5 |
Pages of publication | 1140 - 1148 |
a | 8.3902 ± 0.0001 Å |
b | 11.5601 ± 0.0002 Å |
c | 13.0744 ± 0.0002 Å |
α | 90° |
β | 93.309 ± 0.001° |
γ | 90° |
Cell volume | 1265.99 ± 0.03 Å3 |
Cell temperature | 100 ± 2 K |
Ambient diffraction temperature | 100 ± 2 K |
Number of distinct elements | 6 |
Space group number | 14 |
Hermann-Mauguin space group symbol | P 1 21/c 1 |
Hall space group symbol | -P 2ybc |
Residual factor for all reflections | 0.0147 |
Residual factor for significantly intense reflections | 0.014 |
Weighted residual factors for significantly intense reflections | 0.0336 |
Weighted residual factors for all reflections included in the refinement | 0.0338 |
Goodness-of-fit parameter for all reflections included in the refinement | 1.138 |
Diffraction radiation probe | x-ray |
Diffraction radiation wavelength | 0.71073 Å |
Diffraction radiation type | MoKα |